Reaction Details
TargetC-C chemokine receptor type 5
LigandBDBM50115526
Substrate/Competitorn/a
Meas. Tech.ChEMBL_49996 (CHEMBL661336)
Ki 12±n/a nM
Citation Palani, AShapiro, SJosien, HBara, TClader, JWGreenlee, WJCox, KStrizki, JMBaroudy, BM Synthesis, SAR, and biological evaluation of oximino-piperidino-piperidine amides. 1. Orally bioavailable CCR5 receptor antagonists with potent anti-HIV activity. J Med Chem45:3143-60 (2002) C-C chemokine receptor type 5
Name:C-C chemokine receptor type 5
Type:PROTEIN
Mol. Mass.:40803.93
Organism:Mus musculus
Description:ChEMBL_49996
Residue:354
BDBM50115526
NameBDBM50115526
Synonyms:CHEMBL107363 | {4-[(4-Bromo-phenyl)-(2-methoxy-ethoxyimino)-methyl]-4'-methyl-[1,4']bipiperidinyl-1'-yl}-(2,6-dimethyl-phenyl)-methanone
TypeSmall organic molecule
Emp. Form.C30H40BrN3O3
Mol. Mass.570.561
SMILESCOCCO\N=C(\C1CCN(CC1)C1(C)CCN(CC1)C(=O)c1c(C)cccc1C)c1ccc(Br)cc1