Reaction Details
TargetC-C chemokine receptor type 5
LigandBDBM50104943
Substrate/Competitorn/a
Meas. Tech.ChEMBL_49996 (CHEMBL661336)
Ki 58±n/a nM
Citation Palani, AShapiro, SJosien, HBara, TClader, JWGreenlee, WJCox, KStrizki, JMBaroudy, BM Synthesis, SAR, and biological evaluation of oximino-piperidino-piperidine amides. 1. Orally bioavailable CCR5 receptor antagonists with potent anti-HIV activity. J Med Chem45:3143-60 (2002) C-C chemokine receptor type 5
Name:C-C chemokine receptor type 5
Type:PROTEIN
Mol. Mass.:40803.93
Organism:Mus musculus
Description:ChEMBL_49996
Residue:354
BDBM50104943
NameBDBM50104943
Synonyms:4-[(4-Bromophenyl)methyl]-1'-(2,6-dimethylbenzoyl)-4'-methyl-1,4'-bipiperidine [4-(4-Bromo-benzyl)-4'-methyl-[1,4']bipiperidinyl-1'-yl]-(2,6-dimethyl-phenyl)-methanone
TypeSmall organic molecule
Emp. Form.C27H35BrN2O
Mol. Mass.483.484
SMILESCc1cccc(C)c1C(=O)N1CCC(C)(CC1)N1CCC(Cc2ccc(Br)cc2)CC1