Reaction Details
TargetBeta-lactamase
LigandBDBM50115620
Substrate/Competitorn/a
Meas. Tech.ChEMBL_35527 (CHEMBL649553)
Ki 150±n/a nM
Citation Powers, RAShoichet, BK Structure-based approach for binding site identification on AmpC beta-lactamase. J Med Chem45:3222-34 (2002) Beta-lactamase
Name:Beta-lactamase
Type:Protien
Mol. Mass.:41561.62
Organism:Escherichia coli
Description:P00811
Residue:377
BDBM50115620
NameBDBM50115620
Synonyms:3-(2-Chloro-phenyl)-5-methyl-2,3-dihydro-isoxazole-4-carboxylic acid dihydroxyboranylmethyl-amide CHEMBL324688 | N-[5-METHYL-3-O-TOLYL-ISOXAZOLE-4-CARBOXYLIC ACID AMIDE] BORONIC ACID
TypeSmall organic molecule
Emp. Form.C12H12BClN2O4
Mol. Mass.294.499
SMILESCc1onc(c1C(=O)NCB(O)O)-c1ccccc1Cl