Reaction Details
TargetProto-oncogene tyrosine-protein kinase Src
LigandBDBM50116391
Substrate/Competitorn/a
Meas. Tech.ChEMBL_216847 (CHEMBL818270)
IC50 12±n/a nM
Citation Snow, RJCardozo, MGMorwick, TMBusacca, CADong, YEckner, RJJacober, SJakes, SKapadia, SLukas, SPanzenbeck, MPeet, GWPeterson, JDProkopowicz, ASSellati, RTolbert, RMTschantz, MAMoss, N Discovery of 2-phenylamino-imidazo[4,5-h]isoquinolin-9-ones: a new class of inhibitors of lck kinase. J Med Chem45:3394-405 (2002) Proto-oncogene tyrosine-protein kinase Src
Name:Proto-oncogene tyrosine-protein kinase Src
Type:Protein
Mol. Mass.:59838.60
Organism:Homo sapiens (Human)
Description:P12931
Residue:536
BDBM50116391
NameBDBM50116391
Synonyms:2-(2,6-Dichloro-phenylamino)-6,7-dimethyl-1,8-dihydro-imidazo[4,5-h]isoquinolin-9-one | CHEMBL27085
TypeSmall organic molecule
Emp. Form.C18H14Cl2N4O
Mol. Mass.373.236
SMILESCc1[nH]c(=O)c2c3nc(Nc4c(Cl)cccc4Cl)[nH]c3ccc2c1C