Reaction Details
TargetTyrosine-protein kinase Lck
LigandBDBM50116401
Substrate/Competitorn/a
Meas. Tech.ChEMBL_221318 (CHEMBL841208)
IC50 18±n/a nM
Citation Snow, RJCardozo, MGMorwick, TMBusacca, CADong, YEckner, RJJacober, SJakes, SKapadia, SLukas, SPanzenbeck, MPeet, GWPeterson, JDProkopowicz, ASSellati, RTolbert, RMTschantz, MAMoss, N Discovery of 2-phenylamino-imidazo[4,5-h]isoquinolin-9-ones: a new class of inhibitors of lck kinase. J Med Chem45:3394-405 (2002) Tyrosine-protein kinase Lck
Name:Tyrosine-protein kinase Lck
Type:n/a
Mol. Mass.:57987.83
Organism:Homo sapiens (Human)
Description:P06239
Residue:509
BDBM50116401
NameBDBM50116401
Synonyms:6,7-Dimethyl-2-(2,4,6-trichloro-phenylamino)-1,8-dihydro-imidazo[4,5-h]isoquinolin-9-one | CHEMBL327060
TypeSmall organic molecule
Emp. Form.C18H13Cl3N4O
Mol. Mass.407.681
SMILESCc1[nH]c(=O)c2c3nc(Nc4c(Cl)cc(Cl)cc4Cl)[nH]c3ccc2c1C