Reaction Details
TargetCholinesterase
LigandBDBM50555837
Substrate/Competitorn/a
Meas. Tech.ChEMBL_2053699 (CHEMBL4708700)
Ki 8.3±n/a nM
Citation Sobolova, KHrabinova, MHepnarova, VKucera, TKobrlova, TBenkova, MJanockova, JDolezal, RPrchal, LBenek, OMezeiova, EJun, DSoukup, OKorabecny, J Discovery of novel berberine derivatives with balanced cholinesterase and prolyl oligopeptidase inhibition profile. Eur J Med Chem203:0 (2020) 
 
Cholinesterase
Name:Cholinesterase
Type:Homotetramer
Mol. Mass.:68422.27
Organism:Homo sapiens (Human)
Description:P06276
Residue:602
BDBM50555837
NameBDBM50555837
Synonyms:CHEMBL4747577
TypeSmall organic molecule
Emp. Form.C30H24BrNO4
Mol. Mass.542.42
SMILES[Br-].COc1ccc2cc3-c4cc5OCOc5cc4CC[n+]3cc2c1OCc1ccc2ccccc2c1