Reaction Details
TargetFatty-acid amide hydrolase 1
LigandBDBM26144
Substrate/Competitorn/a
Meas. Tech.ChEMBL_68777 (CHEMBL686015)
Ki 5000±n/a nM
Citation van der Stelt, Mvan Kuik, JABari, Mvan Zadelhoff, GLeeflang, BRVeldink, GAFinazzi-Agrò, AVliegenthart, JFMaccarrone, M Oxygenated metabolites of anandamide and 2-arachidonoylglycerol: conformational analysis and interaction with cannabinoid receptors, membrane transporter, and fatty acid amide hydrolase. J Med Chem45:3709-20 (2002) Fatty-acid amide hydrolase 1
Name:Fatty-acid amide hydrolase 1
Type:Protein
Mol. Mass.:63071.19
Organism:Homo sapiens (Human)
Description:O00519
Residue:579
BDBM26144
NameBDBM26144
Synonyms:1,3-dihydroxypropan-2-yl (5Z,8Z,11Z,14Z)-icosa-5,8,11,14-tetraenoate 2-arachidonoylglycerol (2-AG) CHEMBL122972
TypeEndocannabinoids
Emp. Form.C23H38O4
Mol. Mass.378.5454
SMILESCCCCC\C=C/C\C=C/C\C=C/C\C=C/CCCC(=O)OC(CO)CO