Reaction Details
TargetCannabinoid receptor 1
LigandBDBM26144
Substrate/Competitorn/a
Meas. Tech.ChEMBL_46810 (CHEMBL659696)
Ki 100±n/a nM
Citation van der Stelt, Mvan Kuik, JABari, Mvan Zadelhoff, GLeeflang, BRVeldink, GAFinazzi-Agrò, AVliegenthart, JFMaccarrone, M Oxygenated metabolites of anandamide and 2-arachidonoylglycerol: conformational analysis and interaction with cannabinoid receptors, membrane transporter, and fatty acid amide hydrolase. J Med Chem45:3709-20 (2002) Cannabinoid receptor 1
Name:Cannabinoid receptor 1
Type:G Protein-Coupled Receptor (GPCR)
Mol. Mass.:52856.55
Organism:Rattus norvegicus (rat)
Description:P20272
Residue:473
BDBM26144
NameBDBM26144
Synonyms:1,3-dihydroxypropan-2-yl (5Z,8Z,11Z,14Z)-icosa-5,8,11,14-tetraenoate 2-arachidonoylglycerol (2-AG) CHEMBL122972
TypeEndocannabinoids
Emp. Form.C23H38O4
Mol. Mass.378.5454
SMILESCCCCC\C=C/C\C=C/C\C=C/C\C=C/CCCC(=O)OC(CO)CO