Reaction Details
TargetDelta-type opioid receptor
LigandBDBM50117262
Substrate/Competitorn/a
Meas. Tech.ChEMBL_223417 (CHEMBL844029)
IC50 0.260000±n/a nM
Citation Rew, YMalkmus, SSvensson, CYaksh, TLChung, NNSchiller, PWCassel, JADeHaven, RNTaulane, JPGoodman, M Synthesis and biological activities of cyclic lanthionine enkephalin analogues: delta-opioid receptor selective ligands. J Med Chem45:3746-54 (2002) Delta-type opioid receptor
Name:Delta-type opioid receptor
Type:Enzyme Catalytic Domain
Mol. Mass.:40577.25
Organism:MOUSE
Description:P32300
Residue:372
BDBM50117262
NameBDBM50117262
Synonyms:12-[2-Amino-3-(4-hydroxy-phenyl)-propionylamino]-6-benzyl-13,13-dimethyl-5,8,11-trioxo-1-thia-4,7,10-triaza-cyclotridecane-3-carboxylic acid | CHEMBL331043
TypeSmall organic molecule
Emp. Form.C28H35N5O7S
Mol. Mass.585.672
SMILESCC1(C)SC[C@H](NC(=O)[C@H](Cc2ccccc2)NC(=O)CNC(=O)[C@@H]1NC(=O)[C@@H](N)Cc1ccc(O)cc1)C(O)=O