Reaction Details
TargetCannabinoid receptor 1
LigandBDBM50556535
Substrate/Competitorn/a
Meas. Tech.ChEMBL_2056361 (CHEMBL4711362)
EC50 0.360000±n/a nM
Citation Arena, CGado, FDi Cesare Mannelli, LCervetto, CCarpi, SReynoso-Moreno, IPolini, BVallini, EChicca, SLucarini, EBertini, SD'Andrea, FDigiacomo, MPoli, GTuccinardi, TMacchia, MGertsch, JMarcoli, MNieri, PGhelardini, CChicca, AManera, C The endocannabinoid system dual-target ligand N-cycloheptyl-1,2-dihydro-5-bromo-1-(4-fluorobenzyl)-6-methyl-2-oxo-pyridine-3-carboxamide improves disease severity in a mouse model of multiple sclerosis. Eur J Med Chem208:0 (2020) 
 
Cannabinoid receptor 1
Name:Cannabinoid receptor 1
Type:G Protein-Coupled Receptor (GPCR)
Mol. Mass.:52868.96
Organism:Homo sapiens (Human)
Description:P21554
Residue:472
BDBM50556535
NameBDBM50556535
Synonyms:CHEMBL4782654
TypeSmall organic molecule
Emp. Form.C27H29FN2O2
Mol. Mass.432.5298
SMILESCc1c(cc(C(=O)NC2CCCCCC2)c(=O)n1Cc1ccc(F)cc1)-c1ccccc1