Reaction Details
TargetCholesteryl ester transfer protein
LigandBDBM50118044
Substrate/Competitorn/a
Meas. Tech.ChEMBL_48931 (CHEMBL665926)
IC50 24000±n/a nM
Citation Durley, RCGrapperhaus, MLHickory, BSMassa, MAWang, JLSpangler, DPMischke, DAParnas, BLFobian, YMRath, NPHonda, DDZeng, MConnolly, DTHeuvelman, DMWitherbee, BJMelton, MAGlenn, KCKrul, ESSmith, MESikorski, JA Chiral N,N-disubstituted trifluoro-3-amino-2-propanols are potent inhibitors of cholesteryl ester transfer protein. J Med Chem45:3891-904 (2002) Cholesteryl ester transfer protein
Name:Cholesteryl ester transfer protein
Type:Enzyme
Mol. Mass.:54751.53
Organism:Homo sapiens (Human)
Description:P11597
Residue:493
BDBM50118044
NameBDBM50118044
Synonyms:1,1,1-Trifluoro-3-[(3-phenoxy-phenyl)-(3-trifluoromethylsulfanyl-benzyl)-amino]-propan-2-ol CHEMBL129412
TypeSmall organic molecule
Emp. Form.C23H19F6NO2S
Mol. Mass.487.458
SMILESOC(CN(Cc1cccc(SC(F)(F)F)c1)c1cccc(Oc2ccccc2)c1)C(F)(F)F