Reaction Details
TargetTranslocator protein
LigandBDBM50118538
Substrate/Competitorn/a
Meas. Tech.ChEMBL_37198 (CHEMBL650799)
Ki 11.5±n/a nM
Citation Campiani, GRamunno, AFiorini, INacci, VMorelli, ENovellino, EGoegan, MMennini, TSullivan, SZisterer, DMWilliams, CD Synthesis of new molecular probes for investigation of steroid biosynthesis induced by selective interaction with peripheral type benzodiazepine receptors (PBR). J Med Chem45:4276-81 (2002) Translocator protein
Name:Translocator protein
Type:Mitochondrion membrane protein
Mol. Mass.:18945.84
Organism:Rattus norvegicus (rat)
Description:Competitive binding experiments were performed on rat kidney mitochondrial membranes.
Residue:169
BDBM50118538
NameBDBM50118538
Synonyms:CHEMBL135663 | Diethyl-carbamic acid 5-thiophen-2-yl-6-oxa-10b-aza-benzo[e]azulen-4-yl ester
TypeSmall organic molecule
Emp. Form.C21H20N2O3S
Mol. Mass.380.46
SMILESCCN(CC)C(=O)OC1=C(Oc2ccccc2-n2cccc12)c1cccs1