Reaction Details
TargetTranslocator protein
LigandBDBM50118541
Substrate/Competitorn/a
Meas. Tech.ChEMBL_37200 (CHEMBL650801)
Ki 0.47±n/a nM
Citation Campiani, GRamunno, AFiorini, INacci, VMorelli, ENovellino, EGoegan, MMennini, TSullivan, SZisterer, DMWilliams, CD Synthesis of new molecular probes for investigation of steroid biosynthesis induced by selective interaction with peripheral type benzodiazepine receptors (PBR). J Med Chem45:4276-81 (2002) Translocator protein
Name:Translocator protein
Type:Mitochondrion membrane protein
Mol. Mass.:18945.84
Organism:Rattus norvegicus (rat)
Description:Competitive binding experiments were performed on rat kidney mitochondrial membranes.
Residue:169
BDBM50118541
NameBDBM50118541
Synonyms:CHEMBL445583 | Cyclopropyl-carbamic acid 5-phenyl-6-oxa-10b-aza-benzo[e]azulen-4-yl ester
TypeSmall organic molecule
Emp. Form.C22H18N2O3
Mol. Mass.358.3899
SMILESO=C(NC1CC1)OC1=C(Oc2ccccc2-n2cccc12)c1ccccc1