Reaction Details
TargetTranslocator protein
LigandBDBM50118544
Substrate/Competitorn/a
Meas. Tech.ChEMBL_37198 (CHEMBL650799)
Ki 0.69±n/a nM
Citation Campiani, GRamunno, AFiorini, INacci, VMorelli, ENovellino, EGoegan, MMennini, TSullivan, SZisterer, DMWilliams, CD Synthesis of new molecular probes for investigation of steroid biosynthesis induced by selective interaction with peripheral type benzodiazepine receptors (PBR). J Med Chem45:4276-81 (2002) Translocator protein
Name:Translocator protein
Type:Mitochondrion membrane protein
Mol. Mass.:18945.84
Organism:Rattus norvegicus (rat)
Description:Competitive binding experiments were performed on rat kidney mitochondrial membranes.
Residue:169
BDBM50118544
NameBDBM50118544
Synonyms:CHEMBL335085 | Methyl-propyl-carbamic acid 5-phenyl-6-oxa-10b-aza-benzo[e]azulen-4-yl ester
TypeSmall organic molecule
Emp. Form.C23H22N2O3
Mol. Mass.374.4324
SMILESCCCN(C)C(=O)OC1=C(Oc2ccccc2-n2cccc12)c1ccccc1