Reaction Details
TargetSodium-dependent noradrenaline transporter
LigandBDBM50118599
Substrate/Competitorn/a
Meas. Tech.ChEMBL_142775 (CHEMBL750496)
IC50 93±n/a nM
Citation Prisinzano, TGreiner, EJohnson, EMDersch, CMMarcus, JPartilla, JSRothman, RBJacobson, AERice, KC Piperidine analogues of 1-[2-[bis(4-fluorophenyl)methoxy]ethyl]-4-(3-phenylpropyl)piperazine (GBR 12909): high affinity ligands for the dopamine transporter. J Med Chem45:4371-4 (2002) Sodium-dependent noradrenaline transporter
Name:Sodium-dependent noradrenaline transporter
Type:Multi-pass membrane protein
Mol. Mass.:69337.72
Organism:Homo sapiens (Human)
Description:P23975
Residue:617
BDBM50118599
NameBDBM50118599
Synonyms:4-(2-(bis(4-fluorophenyl)methoxy)ethyl)-1-(naphthalen-2-ylmethyl)piperidine CHEMBL416409
TypeSmall organic molecule
Emp. Form.C31H31F2NO
Mol. Mass.471.5807
SMILESFc1ccc(cc1)C(OCCC1CCN(Cc2ccc3ccccc3c2)CC1)c1ccc(F)cc1