Reaction Details
TargetGlutathionylspermidine synthase
LigandBDBM50118638
Substrate/Competitorn/a
Meas. Tech.ChEMBL_72764 (CHEMBL879021)
Ki 6400±n/a nM
Citation Amssoms, KOza, SLAugustyns, KYamani, ALambeir, AMBal, GVan der Veken, PFairlamb, AHHaemers, A Glutathione-like tripeptides as inhibitors of glutathionylspermidine synthetase. Part 2: substitution of the glycine part. Bioorg Med Chem Lett12:2703-5 (2002) Glutathionylspermidine synthase
Name:Glutathionylspermidine synthase
Type:PROTEIN
Mol. Mass.:80299.94
Organism:Crithidia fasciculata
Description:ChEMBL_72759
Residue:719
BDBM50118638
NameBDBM50118638
Synonyms:2-[(S)-2-((S)-4-Amino-4-carboxy-butyrylamino)-4-methyl-pentanoylamino]-5-guanidino-pentanoic acid | CHEMBL91148
TypeSmall organic molecule
Emp. Form.C17H32N6O6
Mol. Mass.416.4726
SMILESCC(C)C[C@H](NC(=O)CC[C@H](N)C(O)=O)C(=O)N[C@@H](CCCNC(N)=N)C(O)=O