Reaction Details
TargetReceptor-type tyrosine-protein phosphatase alpha
LigandBDBM50118771
Substrate/Competitorn/a
Meas. Tech.ChEMBL_162603 (CHEMBL771315)
pH5.5±n/a
Ki 215000±n/a nM
Commentsextracted
Citation Andersen, HSOlsen, OHIversen, LFSørensen, ALMortensen, SBChristensen, MSBranner, SHansen, TKLau, JFJeppesen, LMoran, EJSu, JBakir, FJudge, LShahbaz, MCollins, TVo, TNewman, MJRipka, WCMøller, NP Discovery and SAR of a novel selective and orally bioavailable nonpeptide classical competitive inhibitor class of protein-tyrosine phosphatase 1B. J Med Chem45:4443-59 (2002) Receptor-type tyrosine-protein phosphatase alpha
Name:Receptor-type tyrosine-protein phosphatase alpha
Type:Enzyme
Mol. Mass.:90719.02
Organism:Homo sapiens (Human)
Description:P18433
Residue:802
BDBM50118771
NameBDBM50118771
Synonyms:2-(carboxyformamido)-6-hydroxy-4,5,6,7-tetrahydrobenzo[b]thiophene-3-carboxylic acid CHEMBL139356
TypeSmall organic molecule
Emp. Form.C11H11NO6S
Mol. Mass.285.273
SMILESOC1CCc2c(C1)sc(NC(=O)C(O)=O)c2C(O)=O