Reaction Details
TargetReceptor-type tyrosine-protein phosphatase F
LigandBDBM50118780
Substrate/Competitorn/a
Meas. Tech.ChEMBL_162594 (CHEMBL768410)
pH5.5±n/a
Ki 165000±n/a nM
Commentsextracted
Citation Andersen, HSOlsen, OHIversen, LFSørensen, ALMortensen, SBChristensen, MSBranner, SHansen, TKLau, JFJeppesen, LMoran, EJSu, JBakir, FJudge, LShahbaz, MCollins, TVo, TNewman, MJRipka, WCMøller, NP Discovery and SAR of a novel selective and orally bioavailable nonpeptide classical competitive inhibitor class of protein-tyrosine phosphatase 1B. J Med Chem45:4443-59 (2002) Receptor-type tyrosine-protein phosphatase F
Name:Receptor-type tyrosine-protein phosphatase F
Type:Protein
Mol. Mass.:212869.85
Organism:Homo sapiens (Human)
Description:P10586
Residue:1907
BDBM50118780
NameBDBM50118780
Synonyms:3-(carboxyformamido)-5-(3-nitrophenyl)thiophene-2-carboxylic acid CHEMBL141481
TypeSmall organic molecule
Emp. Form.C13H8N2O7S
Mol. Mass.336.277
SMILESOC(=O)C(=O)Nc1cc(sc1C(O)=O)-c1cccc(c1)[N+]([O-])=O