Reaction Details
TargetReceptor-type tyrosine-protein phosphatase alpha
LigandBDBM50118782
Substrate/Competitorn/a
Meas. Tech.ChEMBL_162603 (CHEMBL771315)
pH5.5±n/a
Ki 210000±n/a nM
Commentsextracted
Citation Andersen, HSOlsen, OHIversen, LFSørensen, ALMortensen, SBChristensen, MSBranner, SHansen, TKLau, JFJeppesen, LMoran, EJSu, JBakir, FJudge, LShahbaz, MCollins, TVo, TNewman, MJRipka, WCMøller, NP Discovery and SAR of a novel selective and orally bioavailable nonpeptide classical competitive inhibitor class of protein-tyrosine phosphatase 1B. J Med Chem45:4443-59 (2002) Receptor-type tyrosine-protein phosphatase alpha
Name:Receptor-type tyrosine-protein phosphatase alpha
Type:Enzyme
Mol. Mass.:90719.02
Organism:Homo sapiens (Human)
Description:P18433
Residue:802
BDBM50118782
NameBDBM50118782
Synonyms:3-(carboxyformamido)-5-(4-hydroxyphenyl)thiophene-2-carboxylic acid CHEMBL337759
TypeSmall organic molecule
Emp. Form.C13H9NO6S
Mol. Mass.307.279
SMILESOC(=O)C(=O)Nc1cc(sc1C(O)=O)-c1ccc(O)cc1