Reaction Details
TargetReceptor-type tyrosine-protein phosphatase F
LigandBDBM50118744
Substrate/Competitorn/a
Meas. Tech.ChEMBL_162594 (CHEMBL768410)
pH5.5±n/a
Ki 360000±n/a nM
Commentsextracted
Citation Andersen, HSOlsen, OHIversen, LFSørensen, ALMortensen, SBChristensen, MSBranner, SHansen, TKLau, JFJeppesen, LMoran, EJSu, JBakir, FJudge, LShahbaz, MCollins, TVo, TNewman, MJRipka, WCMøller, NP Discovery and SAR of a novel selective and orally bioavailable nonpeptide classical competitive inhibitor class of protein-tyrosine phosphatase 1B. J Med Chem45:4443-59 (2002) Receptor-type tyrosine-protein phosphatase F
Name:Receptor-type tyrosine-protein phosphatase F
Type:Protein
Mol. Mass.:212869.85
Organism:Homo sapiens (Human)
Description:P10586
Residue:1907
BDBM50118744
NameBDBM50118744
Synonyms:2-(Oxalyl-amino)-4,7-dihydro-5H-thieno[2,3-c]pyran-3-carboxylic acid CHEMBL138806
TypeSmall organic molecule
Emp. Form.C10H9NO6S
Mol. Mass.271.247
SMILESOC(=O)C(=O)Nc1sc2COCCc2c1C(O)=O