Reaction Details
TargetReceptor-type tyrosine-protein phosphatase alpha
LigandBDBM50118745
Substrate/Competitorn/a
Meas. Tech.ChEMBL_162603 (CHEMBL771315)
pH5.5±n/a
Ki 65000±n/a nM
Commentsextracted
Citation Andersen, HSOlsen, OHIversen, LFSørensen, ALMortensen, SBChristensen, MSBranner, SHansen, TKLau, JFJeppesen, LMoran, EJSu, JBakir, FJudge, LShahbaz, MCollins, TVo, TNewman, MJRipka, WCMøller, NP Discovery and SAR of a novel selective and orally bioavailable nonpeptide classical competitive inhibitor class of protein-tyrosine phosphatase 1B. J Med Chem45:4443-59 (2002) Receptor-type tyrosine-protein phosphatase alpha
Name:Receptor-type tyrosine-protein phosphatase alpha
Type:Enzyme
Mol. Mass.:90719.02
Organism:Homo sapiens (Human)
Description:P18433
Residue:802
BDBM50118745
NameBDBM50118745
Synonyms:5-(4-(benzyloxy)phenyl)-3-(carboxyformamido)thiophene-2-carboxylic acid CHEMBL343979
TypeSmall organic molecule
Emp. Form.C20H15NO6S
Mol. Mass.397.401
SMILESOC(=O)C(=O)Nc1cc(sc1C(O)=O)-c1ccc(OCc2ccccc2)cc1