Reaction Details
TargetReceptor-type tyrosine-protein phosphatase alpha
LigandBDBM50118787
Substrate/Competitorn/a
Meas. Tech.ChEMBL_162603 (CHEMBL771315)
pH5.5±n/a
Ki 100000±n/a nM
Commentsextracted
Citation Andersen, HSOlsen, OHIversen, LFSørensen, ALMortensen, SBChristensen, MSBranner, SHansen, TKLau, JFJeppesen, LMoran, EJSu, JBakir, FJudge, LShahbaz, MCollins, TVo, TNewman, MJRipka, WCMøller, NP Discovery and SAR of a novel selective and orally bioavailable nonpeptide classical competitive inhibitor class of protein-tyrosine phosphatase 1B. J Med Chem45:4443-59 (2002) Receptor-type tyrosine-protein phosphatase alpha
Name:Receptor-type tyrosine-protein phosphatase alpha
Type:Enzyme
Mol. Mass.:90719.02
Organism:Homo sapiens (Human)
Description:P18433
Residue:802
BDBM50118787
NameBDBM50118787
Synonyms:2-(Oxalyl-amino)-4,7-dihydro-5H-thieno[2,3-c]thiopyran-3-carboxylic acid CHEMBL139423
TypeSmall organic molecule
Emp. Form.C10H9NO5S2
Mol. Mass.287.312
SMILESOC(=O)C(=O)Nc1sc2CSCCc2c1C(O)=O