Reaction Details
TargetReceptor-type tyrosine-protein phosphatase alpha
LigandBDBM50118763
Substrate/Competitorn/a
Meas. Tech.ChEMBL_162603 (CHEMBL771315)
pH5.5±n/a
Ki 322000±n/a nM
Commentsextracted
Citation Andersen, HSOlsen, OHIversen, LFSørensen, ALMortensen, SBChristensen, MSBranner, SHansen, TKLau, JFJeppesen, LMoran, EJSu, JBakir, FJudge, LShahbaz, MCollins, TVo, TNewman, MJRipka, WCMøller, NP Discovery and SAR of a novel selective and orally bioavailable nonpeptide classical competitive inhibitor class of protein-tyrosine phosphatase 1B. J Med Chem45:4443-59 (2002) Receptor-type tyrosine-protein phosphatase alpha
Name:Receptor-type tyrosine-protein phosphatase alpha
Type:Enzyme
Mol. Mass.:90719.02
Organism:Homo sapiens (Human)
Description:P18433
Residue:802
BDBM50118763
NameBDBM50118763
Synonyms:2-(Oxalyl-amino)-6,6-dioxo-4,5,6,7-tetrahydro-6lambda*6*-thieno[2,3-c]thiopyran-3-carboxylic acid CHEMBL343587
TypeSmall organic molecule
Emp. Form.C10H9NO7S2
Mol. Mass.319.311
SMILESOC(=O)C(=O)Nc1sc2CS(=O)(=O)CCc2c1C(O)=O