Reaction Details
TargetTyrosine-protein phosphatase non-receptor type 1
LigandBDBM50118765
Substrate/Competitorn/a
Meas. Tech.ChEMBL_162283 (CHEMBL770981)
pH5.5±n/a
Ki 2500±n/a nM
Commentsextracted
Citation Andersen, HSOlsen, OHIversen, LFSørensen, ALMortensen, SBChristensen, MSBranner, SHansen, TKLau, JFJeppesen, LMoran, EJSu, JBakir, FJudge, LShahbaz, MCollins, TVo, TNewman, MJRipka, WCMøller, NP Discovery and SAR of a novel selective and orally bioavailable nonpeptide classical competitive inhibitor class of protein-tyrosine phosphatase 1B. J Med Chem45:4443-59 (2002) Tyrosine-protein phosphatase non-receptor type 1
Name:Tyrosine-protein phosphatase non-receptor type 1
Type:Protein phosphatase
Mol. Mass.:49963.76
Organism:Homo sapiens (Human)
Description:Human recombinant GST-fusion PTP1B (1-435).
Residue:435
BDBM50118765
NameBDBM50118765
Synonyms:3-(carboxyformamido)-5-(4-(carboxymethoxy)phenyl)thiophene-2-carboxylic acid CHEMBL138257
TypeSmall organic molecule
Emp. Form.C15H11NO8S
Mol. Mass.365.315
SMILESOC(=O)COc1ccc(cc1)-c1cc(NC(=O)C(O)=O)c(s1)C(O)=O