Reaction Details
TargetAromatase
LigandBDBM9460
Substrate/Competitorn/a
Meas. Tech.ChEBML_36185
IC50 5200±n/a nM
Citation Pouget, CFagnere, CBasly, JPHabrioux, GChulia, AJ Design, synthesis and evaluation of 4-imidazolylflavans as new leads for aromatase inhibition. Bioorg Med Chem Lett12:2859-61 (2002) Aromatase
Name:Aromatase
Type:Enzyme
Mol. Mass.:57888.92
Organism:Homo sapiens (Human)
Description:P11511
Residue:503
BDBM9460
NameBDBM9460
Synonyms:3-(4-aminophenyl)-3-ethyl-piperidine-2,6-dione Aminoglutethimide AG, 4 Cytadren Elipten | aminoglutethimide (AG)
TypeSmall organic molecule
Emp. Form.C13H16N2O2
Mol. Mass.232.2783
SMILESCCC1(CCC(=O)NC1=O)c1ccc(N)cc1