Reaction Details
TargetRAF proto-oncogene serine/threonine-protein kinase
LigandBDBM50557776
Substrate/Competitorn/a
Meas. Tech.ChEMBL_2060072 (CHEMBL4715073)
Ki 0.062000±n/a nM
Citation Huestis, MPDurk, MREigenbrot, CGibbons, PHunsaker, TLLa, HLeung, DHLiu, WMalek, SMerchant, MMoffat, JGMuli, CSOrr, CJParr, BTShanahan, FSneeringer, CJWang, WYen, IYin, JRudolph, JSiu, M Targeting KRAS Mutant Cancers via Combination Treatment: Discovery of a Pyridopyridazinone pan-RAF Kinase Inhibitor. ACS Med Chem Lett12:791-797 (2021) 
 
RAF proto-oncogene serine/threonine-protein kinase
Name:RAF proto-oncogene serine/threonine-protein kinase
Type:Serine/threonine-protein kinase
Mol. Mass.:73082.52
Organism:Homo sapiens (Human)
Description:P04049
Residue:648
BDBM50557776
NameBDBM50557776
Synonyms:CHEMBL4778419
TypeSmall organic molecule
Emp. Form.C26H22FN5O2
Mol. Mass.455.4836
SMILESCc1cc(F)c(NC(=O)c2cccc(c2)C(C)(C)C#N)cc1-c1cnc2c(cnn(C)c2=O)c1