Reaction Details
TargetEndothelin-converting enzyme 1
LigandBDBM50119757
Substrate/Competitorn/a
Meas. Tech.ChEBML_64356
IC50 24±n/a nM
Citation Firooznia, FGude, CChan, KTan, JFink, CASavage, PBeil, MEBruseo, CWTrapani, AJJeng, AY Synthesis and biological activity of potent heterocyclic thiol-based inhibitors of endothelin-converting enzyme-1. Bioorg Med Chem Lett12:3059-62 (2002) Endothelin-converting enzyme 1
Name:Endothelin-converting enzyme 1
Type:Enzyme
Mol. Mass.:87155.11
Organism:Homo sapiens (Human)
Description:P42892
Residue:770
BDBM50119757
NameBDBM50119757
Synonyms:2-{[1-((S)-2-Mercapto-hexanoylamino)-cyclopentanecarbonyl]-amino}-3-(6-thiophen-3-yl-pyridin-3-yl)-propionic acid | CHEMBL421021
TypeSmall organic molecule
Emp. Form.C24H31N3O4S2
Mol. Mass.489.651
SMILESCCCC[C@H](S)C(=O)NC1(CCCC1)C(=O)NC(Cc1ccc(nc1)-c1ccsc1)C(O)=O