Reaction Details
TargetD(2) dopamine receptor
LigandBDBM50119978
Substrate/Competitorn/a
Meas. Tech.ChEBML_62961
Ki 2364±n/a nM
Citation Zhao, HHe, XThurkauf, AHoffman, DKieltyka, ABrodbeck, RPrimus, RWasley, JW Indoline and piperazine containing derivatives as a novel class of mixed D(2)/D(4) receptor antagonists. Part 2: asymmetric synthesis and biological evaluation. Bioorg Med Chem Lett12:3111-5 (2002) D(2) dopamine receptor
Name:D(2) dopamine receptor
Type:Cell-surface receptors
Mol. Mass.:50647.10
Organism:Homo sapiens (Human)
Description:P14416
Residue:443
BDBM50119978
NameBDBM50119978
Synonyms:2-[4-(4-Methyl-benzyl)-piperazin-1-yl]-1-((S)-2-methyl-2,3-dihydro-indol-1-yl)-ethanone | CHEMBL105354
TypeSmall organic molecule
Emp. Form.C23H29N3O
Mol. Mass.363.4959
SMILESC[C@H]1Cc2ccccc2N1C(=O)CN1CCN(Cc2ccc(C)cc2)CC1