Reaction Details
TargetD(4) dopamine receptor
LigandBDBM50119985
Substrate/Competitorn/a
Meas. Tech.ChEBML_62964
Ki 2±n/a nM
Citation Zhao, HHe, XThurkauf, AHoffman, DKieltyka, ABrodbeck, RPrimus, RWasley, JW Indoline and piperazine containing derivatives as a novel class of mixed D(2)/D(4) receptor antagonists. Part 2: asymmetric synthesis and biological evaluation. Bioorg Med Chem Lett12:3111-5 (2002) D(4) dopamine receptor
Name:D(4) dopamine receptor
Type:Enzyme
Mol. Mass.:48373.19
Organism:Homo sapiens (Human)
Description:P21917
Residue:419
BDBM50119985
NameBDBM50119985
Synonyms:2-[4-(3-Fluoro-4-methyl-benzyl)-piperazin-1-yl]-1-((R)-2-methyl-2,3-dihydro-indol-1-yl)-ethanone | CHEMBL317670
TypeSmall organic molecule
Emp. Form.C23H28FN3O
Mol. Mass.381.4863
SMILESC[C@@H]1Cc2ccccc2N1C(=O)CN1CCN(Cc2ccc(C)c(F)c2)CC1