Reaction Details
TargetD(4) dopamine receptor
LigandBDBM50119992
Substrate/Competitorn/a
Meas. Tech.ChEBML_62964
Ki 5±n/a nM
Citation Zhao, HHe, XThurkauf, AHoffman, DKieltyka, ABrodbeck, RPrimus, RWasley, JW Indoline and piperazine containing derivatives as a novel class of mixed D(2)/D(4) receptor antagonists. Part 2: asymmetric synthesis and biological evaluation. Bioorg Med Chem Lett12:3111-5 (2002) D(4) dopamine receptor
Name:D(4) dopamine receptor
Type:Enzyme
Mol. Mass.:48373.19
Organism:Homo sapiens (Human)
Description:P21917
Residue:419
BDBM50119992
NameBDBM50119992
Synonyms:2-[4-(4-Fluoro-benzyl)-piperazin-1-yl]-1-((R)-2-methyl-2,3-dihydro-indol-1-yl)-ethanone | CHEMBL104058
TypeSmall organic molecule
Emp. Form.C22H26FN3O
Mol. Mass.367.4597
SMILESC[C@@H]1Cc2ccccc2N1C(=O)CN1CCN(Cc2ccc(F)cc2)CC1