Reaction Details
TargetD(4) dopamine receptor
LigandBDBM50119972
Substrate/Competitorn/a
Meas. Tech.ChEBML_62964
Ki 11±n/a nM
Citation Zhao, HHe, XThurkauf, AHoffman, DKieltyka, ABrodbeck, RPrimus, RWasley, JW Indoline and piperazine containing derivatives as a novel class of mixed D(2)/D(4) receptor antagonists. Part 2: asymmetric synthesis and biological evaluation. Bioorg Med Chem Lett12:3111-5 (2002) D(4) dopamine receptor
Name:D(4) dopamine receptor
Type:Enzyme
Mol. Mass.:48373.19
Organism:Homo sapiens (Human)
Description:P21917
Residue:419
BDBM50119972
NameBDBM50119972
Synonyms:2-[4-(5-Chloro-2-ethoxy-benzyl)-piperazin-1-yl]-1-((R)-2-methyl-2,3-dihydro-indol-1-yl)-ethanone | CHEMBL326863
TypeSmall organic molecule
Emp. Form.C24H30ClN3O2
Mol. Mass.427.967
SMILESCCOc1ccc(Cl)cc1CN1CCN(CC(=O)N2[C@H](C)Cc3ccccc23)CC1