Reaction Details
TargetTissue-type plasminogen activator
LigandBDBM50120225
Substrate/Competitorn/a
Meas. Tech.ChEMBL_222790 (CHEMBL847118)
IC50 0.700000±n/a nM
Citation Iwanowicz, EJKimball, SDLin, JLau, WHan, WCWang, TCRoberts, DGSchumacher, WAOgletree, MLSeiler, SM Retro-binding thrombin active site inhibitors: identification of an orally active inhibitor of thrombin catalytic activity. Bioorg Med Chem Lett12:3183-6 (2002) Tissue-type plasminogen activator
Name:Tissue-type plasminogen activator
Type:Enzyme
Mol. Mass.:62931.08
Organism:Homo sapiens (Human)
Description:n/a
Residue:562
BDBM50120225
NameBDBM50120225
Synonyms:2-{[2-(4-Guanidino-butyrylamino)-3-(4-nitro-phenyl)-propionyl]-methyl-amino}-3-hydroxy-N-(1-phenyl-ethyl)-butyramide | CHEMBL105819
TypeSmall organic molecule
Emp. Form.C27H37N7O6
Mol. Mass.555.626
SMILESCC(O)C(N(C)C(=O)C(Cc1ccc(cc1)[N+]([O-])=O)NC(=O)CCC[N-]C(N)=[NH2+])C(=O)NC(C)c1ccccc1