Reaction Details
TargetProthrombin
LigandBDBM50120224
Substrate/Competitorn/a
Meas. Tech.ChEBML_34097
IC50 72±n/a nM
Citation Iwanowicz, EJKimball, SDLin, JLau, WHan, WCWang, TCRoberts, DGSchumacher, WAOgletree, MLSeiler, SM Retro-binding thrombin active site inhibitors: identification of an orally active inhibitor of thrombin catalytic activity. Bioorg Med Chem Lett12:3183-6 (2002) Prothrombin
Name:Prothrombin
Type:Protein
Mol. Mass.:70029.57
Organism:Homo sapiens (Human)
Description:P00734
Residue:622
BDBM50120224
NameBDBM50120224
Synonyms:(S)-2-[(S)-2-(4-Guanidino-butyrylamino)-3-(4-nitro-phenyl)-propionylamino]-3-hydroxy-N-((S)-1-phenyl-ethyl)-butyramide CHEMBL320707
TypeSmall organic molecule
Emp. Form.C26H35N7O6
Mol. Mass.541.5994
SMILESCC(O)C(NC(=O)C(Cc1ccc(cc1)[N+]([O-])=O)NC(=O)CCC[N-]C(N)=[NH2+])C(=O)NC(C)c1ccccc1