Reaction Details
Target5-hydroxytryptamine receptor 4
LigandBDBM50558235
Substrate/Competitorn/a
Meas. Tech.ChEMBL_2062398 (CHEMBL4717651)
Ki 8.7±n/a nM
Citation Yahiaoui, SHamidouche, KBallandonne, CDavis, Ade Oliveira Santos, JSFreret, TBoulouard, MRochais, CDallemagne, P Design, synthesis, and pharmacological evaluation of multitarget-directed ligands with both serotonergic subtype 4 receptor (5-HT4R) partial agonist and 5-HT6R antagonist activities, as potential treatment of Alzheimer's disease. Eur J Med Chem121:283-293 (2016) 
 
5-hydroxytryptamine receptor 4
Name:5-hydroxytryptamine receptor 4
Type:Enzyme Catalytic Domain
Mol. Mass.:43735.29
Organism:GUINEA PIG
Description:5-HT4 HTR4 GUINEA PIG::O70528
Residue:388
BDBM50558235
NameBDBM50558235
Synonyms:CHEMBL4799043
TypeSmall organic molecule
Emp. Form.C23H29Br2ClN4O4S
Mol. Mass.652.827
SMILESCOc1cc(N)c(Cl)cc1C(=O)CCC1CCN(CCNS(=O)(=O)c2cc(Br)c(N)c(Br)c2)CC1