Reaction Details
Target5-hydroxytryptamine receptor 4
LigandBDBM50558239
Substrate/Competitorn/a
Meas. Tech.ChEMBL_2062398 (CHEMBL4717651)
Ki 2.0±n/a nM
Citation Yahiaoui, SHamidouche, KBallandonne, CDavis, Ade Oliveira Santos, JSFreret, TBoulouard, MRochais, CDallemagne, P Design, synthesis, and pharmacological evaluation of multitarget-directed ligands with both serotonergic subtype 4 receptor (5-HT4R) partial agonist and 5-HT6R antagonist activities, as potential treatment of Alzheimer's disease. Eur J Med Chem121:283-293 (2016) 
 
5-hydroxytryptamine receptor 4
Name:5-hydroxytryptamine receptor 4
Type:Enzyme Catalytic Domain
Mol. Mass.:43735.29
Organism:GUINEA PIG
Description:5-HT4 HTR4 GUINEA PIG::O70528
Residue:388
BDBM50558239
NameBDBM50558239
Synonyms:CHEMBL4781228
TypeSmall organic molecule
Emp. Form.C23H31ClN4O4S
Mol. Mass.495.035
SMILESCOc1cc(N)c(Cl)cc1C(=O)CCC1CCN(CCNS(=O)(=O)c2ccc(N)cc2)CC1