Reaction Details
Target5-hydroxytryptamine receptor 4
LigandBDBM50558241
Substrate/Competitorn/a
Meas. Tech.ChEMBL_2062398 (CHEMBL4717651)
Ki 8.2±n/a nM
Citation Yahiaoui, SHamidouche, KBallandonne, CDavis, Ade Oliveira Santos, JSFreret, TBoulouard, MRochais, CDallemagne, P Design, synthesis, and pharmacological evaluation of multitarget-directed ligands with both serotonergic subtype 4 receptor (5-HT4R) partial agonist and 5-HT6R antagonist activities, as potential treatment of Alzheimer's disease. Eur J Med Chem121:283-293 (2016) 
 
5-hydroxytryptamine receptor 4
Name:5-hydroxytryptamine receptor 4
Type:Enzyme Catalytic Domain
Mol. Mass.:43735.29
Organism:GUINEA PIG
Description:5-HT4 HTR4 GUINEA PIG::O70528
Residue:388
BDBM50558241
NameBDBM50558241
Synonyms:CHEMBL4760149
TypeSmall organic molecule
Emp. Form.C25H34ClN3O6S
Mol. Mass.540.072
SMILESCOc1ccc(cc1OC)S(=O)(=O)NCCN1CCC(CCC(=O)c2cc(Cl)c(N)cc2OC)CC1