Reaction Details
Target5-hydroxytryptamine receptor 4
LigandBDBM50558245
Substrate/Competitorn/a
Meas. Tech.ChEMBL_2062398 (CHEMBL4717651)
Ki 3.5±n/a nM
Citation Yahiaoui, SHamidouche, KBallandonne, CDavis, Ade Oliveira Santos, JSFreret, TBoulouard, MRochais, CDallemagne, P Design, synthesis, and pharmacological evaluation of multitarget-directed ligands with both serotonergic subtype 4 receptor (5-HT4R) partial agonist and 5-HT6R antagonist activities, as potential treatment of Alzheimer's disease. Eur J Med Chem121:283-293 (2016) 
 
5-hydroxytryptamine receptor 4
Name:5-hydroxytryptamine receptor 4
Type:Enzyme Catalytic Domain
Mol. Mass.:43735.29
Organism:GUINEA PIG
Description:5-HT4 HTR4 GUINEA PIG::O70528
Residue:388
BDBM50558245
NameBDBM50558245
Synonyms:CHEMBL4789661
TypeSmall organic molecule
Emp. Form.C29H42ClN5O5S
Mol. Mass.608.192
SMILESCOc1ccc(cc1N1CCN(C)CC1)S(=O)(=O)NCCN1CCC(CCC(=O)c2cc(Cl)c(N)cc2OC)CC1