Reaction Details
TargetDelta-type opioid receptor
LigandBDBM50120880
Substrate/Competitorn/a
Meas. Tech.ChEMBL_145768 (CHEMBL752786)
IC50>1000±n/a nM
Citation Ogawa, TMiyamae, TMurayama, KOkuyama, KOkayama, THagiwara, MSakurada, SMorikawa, T Synthesis and structure-activity relationships of an orally available and long-acting analgesic peptide, N(alpha)-amidino-Tyr-D-Arg-Phe-MebetaAla-OH (ADAMB). J Med Chem45:5081-9 (2002) Delta-type opioid receptor
Name:Delta-type opioid receptor
Type:Enzyme Catalytic Domain
Mol. Mass.:40577.25
Organism:MOUSE
Description:P32300
Residue:372
BDBM50120880
NameBDBM50120880
Synonyms:2-[(2-{2-[2-Amino-3-(3-hydroxy-phenyl)-propionylamino]-5-guanidino-pentanoylamino}-3-phenyl-propionyl)-methyl-amino]-propionic acid | CHEMBL358665
TypeSmall organic molecule
Emp. Form.C28H39N7O6
Mol. Mass.569.6526
SMILESC[C@H](N(C)C(=O)[C@H](Cc1ccccc1)NC(=O)[C@H](CCCNC(N)=N)NC(=O)[C@@H](N)Cc1cccc(O)c1)C(O)=O