Reaction Details
TargetCathepsin S
LigandBDBM50121038
Substrate/Competitorn/a
Meas. Tech.ChEBML_48690
IC50 4.6±n/a nM
Citation Zhou, NEKaleta, JPurisima, EMenard, RMicetich, RGSingh, R 6-Acylamino-penam derivatives: synthesis and inhibition of cathepsins B, L, K, and S. Bioorg Med Chem Lett12:3417-9 (2002) Cathepsin S
Name:Cathepsin S
Type:Protein
Mol. Mass.:37507.38
Organism:Homo sapiens (Human)
Description:P25774
Residue:331
BDBM50121038
NameBDBM50121038
Synonyms:CHEMBL113706 | [(S)-2-Thiophen-2-yl-1-((5S,6R)-4,4,7-trioxo-4lambda*6*-thia-1-aza-bicyclo[3.2.0]hept-6-ylcarbamoyl)-ethyl]-carbamic acid benzyl ester
TypeSmall organic molecule
Emp. Form.C20H21N3O6S2
Mol. Mass.463.527
SMILESO=C(N[C@@H](Cc1cccs1)C(=O)N[C@H]1[C@H]2N(CCS2(=O)=O)C1=O)OCc1ccccc1