Reaction Details
TargetProcathepsin L
LigandBDBM50121041
Substrate/Competitorn/a
Meas. Tech.ChEBML_48518
IC50 1.4±n/a nM
Citation Zhou, NEKaleta, JPurisima, EMenard, RMicetich, RGSingh, R 6-Acylamino-penam derivatives: synthesis and inhibition of cathepsins B, L, K, and S. Bioorg Med Chem Lett12:3417-9 (2002) Procathepsin L
Name:Procathepsin L
Type:PROTEIN
Mol. Mass.:37662.10
Organism:Rattus norvegicus
Description:ChEMBL_48517
Residue:334
BDBM50121041
NameBDBM50121041
Synonyms:CHEMBL326093 | [(S)-1-((R)-4,7-Dioxo-4-(S)-oxo-4lambda*6*-thia-1-aza-bicyclo[3.2.0]hept-6-ylcarbamoyl)-2-phenyl-ethyl]-carbamic acid benzyl ester
TypeSmall organic molecule
Emp. Form.C22H23N3O6S
Mol. Mass.457.5
SMILESO=C(N[C@@H](Cc1ccccc1)C(=O)N[C@H]1[C@H]2N(CCS2(=O)=O)C1=O)OCc1ccccc1