Reaction Details
TargetMAP kinase-activated protein kinase 3
LigandBDBM2579
Substrate/Competitorn/a
Meas. Tech.ChEMBL_2065418 (CHEMBL4720671)
IC50 2000±n/a nM
Citation Hou, WRen, YZhang, ZSun, HMa, YYan, B Novel quinazoline derivatives bearing various 6-benzamide moieties as highly selective and potent EGFR inhibitors. Bioorg Med Chem26:1740-1750 (2018) 
 
MAP kinase-activated protein kinase 3
Name:MAP kinase-activated protein kinase 3
Type:Serine/threonine-protein kinase
Mol. Mass.:42991.57
Organism:Homo sapiens (Human)
Description:Recombinant MAPKAPK3 was phosphorylated by incubation with active p38alpha before assays.
Residue:382
BDBM2579
NameBDBM2579
Synonyms:(2S,3R,4R,6R)-3-methoxy-2-methyl-4-(methylamino)-29-oxa-1,7,17-triazaoctacyclo[12.12.2.1^{2,6}.0^{7,28}.0^{8,13}.0^{15,19}.0^{20,27}.0^{21,26}]nonacosa-8(13),9,11,14(28),15(19),20(27),21(26),22,24-nonaen-16-one Staurosporin, 4 Staurosporine, 8 US9206188, Staurosporine | US9226923, Staurosporine
TypeSmall organic molecule
Emp. Form.C28H26N4O3
Mol. Mass.466.531
SMILESCN[C@@H]1C[C@H]2O[C@@](C)([C@@H]1OC)n1c3ccccc3c3c4CNC(=O)c4c4c5ccccc5n2c4c13