Reaction Details
TargetPeroxisome proliferator-activated receptor alpha
LigandBDBM50121413
Substrate/Competitorn/a
Meas. Tech.ChEBML_42430
Ki>100000±n/a nM
Citation Thor, MBeierlein, KDykes, GGustavsson, ALHeidrich, JJendeberg, LLindqvist, BPegurier, CRoussel, PSlater, MSvensson, SSydow-Bäckman, MThornström, UUppenberg, J Synthesis and pharmacological evaluation of a new class of peroxisome proliferator-activated receptor modulators. Bioorg Med Chem Lett12:3565-7 (2002) Peroxisome proliferator-activated receptor alpha
Name:Peroxisome proliferator-activated receptor alpha
Type:Enzyme
Mol. Mass.:52222.08
Organism:Homo sapiens (Human)
Description:Q07869
Residue:468
BDBM50121413
NameBDBM50121413
Synonyms:CHEMBL118852 | Lithium; 4-(2,4-dichloro-benzoylamino)-3'-ethoxy-biphenyl-3-carboxylate
TypeSmall organic molecule
Emp. Form.C22H16Cl2NO4
Mol. Mass.429.273
SMILESCCOc1cccc(c1)-c1ccc(NC(=O)c2ccc(Cl)cc2Cl)c(c1)C([O-])=O