Reaction Details
TargetPeroxisome proliferator-activated receptor alpha
LigandBDBM50121417
Substrate/Competitorn/a
Meas. Tech.ChEBML_42430
Ki 19000±n/a nM
Citation Thor, MBeierlein, KDykes, GGustavsson, ALHeidrich, JJendeberg, LLindqvist, BPegurier, CRoussel, PSlater, MSvensson, SSydow-Bäckman, MThornström, UUppenberg, J Synthesis and pharmacological evaluation of a new class of peroxisome proliferator-activated receptor modulators. Bioorg Med Chem Lett12:3565-7 (2002) Peroxisome proliferator-activated receptor alpha
Name:Peroxisome proliferator-activated receptor alpha
Type:Enzyme
Mol. Mass.:52222.08
Organism:Homo sapiens (Human)
Description:Q07869
Residue:468
BDBM50121417
NameBDBM50121417
Synonyms:CHEMBL119646 | Lithium; 2-(2,4-dichloro-benzoylamino)-5-(2-methylsulfanyl-ethoxy)-benzoate
TypeSmall organic molecule
Emp. Form.C17H14Cl2NO4S
Mol. Mass.399.269
SMILESCSCCOc1ccc(NC(=O)c2ccc(Cl)cc2Cl)c(c1)C([O-])=O