Reaction Details
TargetPeroxisome proliferator-activated receptor gamma
LigandBDBM50121415
Substrate/Competitorn/a
Meas. Tech.ChEBML_154362
Ki 500±n/a nM
Citation Thor, MBeierlein, KDykes, GGustavsson, ALHeidrich, JJendeberg, LLindqvist, BPegurier, CRoussel, PSlater, MSvensson, SSydow-Bäckman, MThornström, UUppenberg, J Synthesis and pharmacological evaluation of a new class of peroxisome proliferator-activated receptor modulators. Bioorg Med Chem Lett12:3565-7 (2002) Peroxisome proliferator-activated receptor gamma
Name:Peroxisome proliferator-activated receptor gamma
Type:Nuclear Receptor
Mol. Mass.:57613.46
Organism:Homo sapiens (Human)
Description:P37231
Residue:505
BDBM50121415
NameBDBM50121415
Synonyms:CHEMBL119030 | Lithium; 2-(2,4-dichloro-benzoylamino)-5-furan-2-yl-benzoate
TypeSmall organic molecule
Emp. Form.C18H10Cl2NO4
Mol. Mass.375.183
SMILES[O-]C(=O)c1cc(ccc1NC(=O)c1ccc(Cl)cc1Cl)-c1ccco1