Reaction Details
TargetPeroxisome proliferator-activated receptor alpha
LigandBDBM50121414
Substrate/Competitorn/a
Meas. Tech.ChEMBL_153550 (CHEMBL766091)
Ki 20000±n/a nM
Citation Thor, MBeierlein, KDykes, GGustavsson, ALHeidrich, JJendeberg, LLindqvist, BPegurier, CRoussel, PSlater, MSvensson, SSydow-Bäckman, MThornström, UUppenberg, J Synthesis and pharmacological evaluation of a new class of peroxisome proliferator-activated receptor modulators. Bioorg Med Chem Lett12:3565-7 (2002) Peroxisome proliferator-activated receptor alpha
Name:Peroxisome proliferator-activated receptor alpha
Type:Enzyme
Mol. Mass.:52222.08
Organism:Homo sapiens (Human)
Description:Q07869
Residue:468
BDBM50121414
NameBDBM50121414
Synonyms:CHEMBL333890 | Lithium; 2-(2,4-dichloro-benzoylamino)-5-(2-thiophen-3-yl-ethoxy)-benzoate
TypeSmall organic molecule
Emp. Form.C20H14Cl2NO4S
Mol. Mass.435.301
SMILES[O-]C(=O)c1cc(OCCc2ccsc2)ccc1NC(=O)c1ccc(Cl)cc1Cl