Reaction Details
TargetPeroxisome proliferator-activated receptor gamma
LigandBDBM50121419
Substrate/Competitorn/a
Meas. Tech.ChEBML_154362
Ki 3600±n/a nM
Citation Thor, MBeierlein, KDykes, GGustavsson, ALHeidrich, JJendeberg, LLindqvist, BPegurier, CRoussel, PSlater, MSvensson, SSydow-Bäckman, MThornström, UUppenberg, J Synthesis and pharmacological evaluation of a new class of peroxisome proliferator-activated receptor modulators. Bioorg Med Chem Lett12:3565-7 (2002) Peroxisome proliferator-activated receptor gamma
Name:Peroxisome proliferator-activated receptor gamma
Type:Nuclear Receptor
Mol. Mass.:57613.46
Organism:Homo sapiens (Human)
Description:P37231
Residue:505
BDBM50121419
NameBDBM50121419
Synonyms:CHEMBL119798 | Lithium; 2-(2,4-dichloro-benzoylamino)-5-(4-ethoxy-benzyloxy)-benzoate
TypeSmall organic molecule
Emp. Form.C23H18Cl2NO5
Mol. Mass.459.299
SMILESCCOc1ccc(COc2ccc(NC(=O)c3ccc(Cl)cc3Cl)c(c2)C([O-])=O)cc1