Reaction Details
TargetPeroxisome proliferator-activated receptor gamma
LigandBDBM50121423
Substrate/Competitorn/a
Meas. Tech.ChEBML_154362
Ki 1000±n/a nM
Citation Thor, MBeierlein, KDykes, GGustavsson, ALHeidrich, JJendeberg, LLindqvist, BPegurier, CRoussel, PSlater, MSvensson, SSydow-Bäckman, MThornström, UUppenberg, J Synthesis and pharmacological evaluation of a new class of peroxisome proliferator-activated receptor modulators. Bioorg Med Chem Lett12:3565-7 (2002) Peroxisome proliferator-activated receptor gamma
Name:Peroxisome proliferator-activated receptor gamma
Type:Nuclear Receptor
Mol. Mass.:57613.46
Organism:Homo sapiens (Human)
Description:P37231
Residue:505
BDBM50121423
NameBDBM50121423
Synonyms:CHEMBL119278 | Lithium; 2-(2,4-dichloro-benzoylamino)-5-(2-thiophen-2-yl-ethoxy)-benzoate
TypeSmall organic molecule
Emp. Form.C20H14Cl2NO4S
Mol. Mass.435.301
SMILES[O-]C(=O)c1cc(OCCc2cccs2)ccc1NC(=O)c1ccc(Cl)cc1Cl