Reaction Details
TargetCalcium/calmodulin-dependent protein kinase kinase 1
LigandBDBM50559222
Substrate/Competitorn/a
Meas. Tech.ChEMBL_2068527 (CHEMBL4723780)
Kd 49±n/a nM
Citation Picado, AChaikuad, AWells, CIShrestha, SZuercher, WJPickett, JEKwarcinski, FESinha, Pde Silva, CSZutshi, RLiu, SKannan, NKnapp, SDrewry, DHWillson, TM A Chemical Probe for Dark Kinase STK17B Derives Its Potency and High Selectivity through a Unique P-Loop Conformation. J Med Chem63:14626-14646 (2020) 
 
Calcium/calmodulin-dependent protein kinase kinase 1
Name:Calcium/calmodulin-dependent protein kinase kinase 1
Type:PROTEIN
Mol. Mass.:55727.76
Organism:Homo sapiens (Human)
Description:ChEMBL_774623
Residue:505
BDBM50559222
NameBDBM50559222
Synonyms:CHEMBL4752776
TypeSmall organic molecule
Emp. Form.C16H10N2O2S3
Mol. Mass.358.458
SMILESOC(=O)CSc1ncnc2cc(sc12)-c1cc2ccccc2s1