Reaction Details
TargetPeptide deformylase, mitochondrial
LigandBDBM50121437
Substrate/Competitorn/a
Meas. Tech.ChEMBL_154177 (CHEMBL762381)
IC50>1000±n/a nM
Citation Smith, HKBeckett, RPClements, JMDoel, SEast, SPLaunchbury, SBPratt, LMSpavold, ZMThomas, WTodd, RSWhittaker, M Structure-activity relationships of the peptide deformylase inhibitor BB-3497: modification of the metal binding group. Bioorg Med Chem Lett12:3595-9 (2002) Peptide deformylase, mitochondrial
Name:Peptide deformylase, mitochondrial
Type:PROTEIN
Mol. Mass.:27023.25
Organism:Homo sapiens (Human)
Description:ChEMBL_154318
Residue:243
BDBM50121437
NameBDBM50121437
Synonyms:CHEMBL422076 | [(S)-1-((S)-1-Dimethylcarbamoyl-2,2-dimethyl-propylcarbamoyl)-pentylamino]-acetic acid
TypeSmall organic molecule
Emp. Form.C16H31N3O4
Mol. Mass.329.435
SMILESCCCC[C@H](NCC(O)=O)C(=O)N[C@H](C(=O)N(C)C)C(C)(C)C