Reaction Details
TargetSerine/threonine-protein kinase pim-1
LigandBDBM50559298
Substrate/Competitorn/a
Meas. Tech.ChEMBL_2068630 (CHEMBL4723883)
Ki 1.000000±n/a nM
Citation Han, WDing, YChen, ZLangowski, JLBellamacina, CRico, ANishiguchi, GALan, JAtallah, GLindvall, MLin, SZang, RFeucht, PZavorotinskaya, TDai, YGarcia, PBurger, MT Synthesis and Structure-Activity Relationship of Tetra-Substituted Cyclohexyl Diol Inhibitors of Proviral Insertion of Moloney Virus (PIM) Kinases. J Med Chem63:14885-14904 (2020) 
 
Serine/threonine-protein kinase pim-1
Name:Serine/threonine-protein kinase pim-1
Type:Protein
Mol. Mass.:35681.82
Organism:Homo sapiens (Human)
Description:P11309
Residue:313
BDBM50559298
NameBDBM50559298
Synonyms:CHEMBL4742957
TypeSmall organic molecule
Emp. Form.C25H28FN5O3
Mol. Mass.465.5199
SMILESCC[C@@]1(O)[C@@H](C)C[C@H](C[C@H]1O)c1ccncc1NC(=O)c1nc(ccc1N)-c1ncccc1F